{"text_format":"1","workbook":"xlsx","n_sheets":13,"sheets":["Cover","Summary","Overview of measures","1. Documentation","2. Use and installation","3. Control syst. + command","4. Protection against mech. haz","5. Other hazards ","6. Setting up Maintanace Serv.","7. Risk ass. with electr. Energ","8. Ergonomie","FAQ","D 02-044 PL"],"not_rendered":{"charts":2,"images":7,"macros":1,"external_links":0,"defined_names":34,"comments":1,"pivot_tables":0},"unopened":[],"bounds":{"document_bytes":16777216,"sheet_cells":100000,"rows_first":2000,"rows_last":500,"rows_between":2000,"halvings":0,"cell_chars":16384,"cell_head_chars":4096},"cells_cut":0,"cells_raw":0,"read":"whole","date_system":"1900"}

{"sheet":"Cover","index":0,"n_rows":49,"n_cols":5,"rows_kept":49,"cut":false,"hidden":false,"merged":[[16,0,16,4],[22,1,22,4],[20,1,20,4],[24,1,24,4],[3,4,3,7],[12,1,12,4],[7,1,7,4],[8,1,8,4],[9,1,9,4],[10,1,10,4],[11,1,11,4]]}
["I. Nature of the inspection "]
[]
[null,null,null,null,"Transaction No.:"]
[]
[]
["II. Details of the machine"]
[]
["Designation"]
{"$rows_left_out":42}
{"sheet":"Summary","index":1,"n_rows":50,"n_cols":3,"rows_kept":50,"cut":false,"hidden":false,"merged":[[18,2,20,2],[3,0,4,1],[3,2,4,2],[49,0,52,2]]}
[]
["Summary FSS 5 - Check"]
[]
["internal machine/system designation",null,{"$f":"IF(Cover!B8=\"\",\"\",Cover!B8)","v":""}]
[]
["Transaction No.:",null,{"$f":"IF(Cover!E4=\"\",\"\",Cover!E4)","v":""}]
[]
["Chapter","Assessment","Description"]
{"$rows_left_out":43}
{"sheet":"Overview of measures","index":2,"n_rows":169,"n_cols":12,"rows_kept":169,"cut":false,"hidden":false,"merged":[[3,6,4,6],[3,0,3,1],[4,0,4,1],[8,7,23,7],[1,8,5,8],[7,8,10,8]]}
[]
[" Overview of measures FSS 5- Check",null,null,null,null,null,null,0,"% enclosed\n25 % design/conceptual design\n50 % start implementation\n75 %  implemented\n100 % measures implemented  / effictiveness checked"]
[null,null,null,null,null,null,null,0.25]
["internal machine/system designation",null,{"$f":"IF(Cover!B8=\"\",\"\",Cover!B8)","v":""},null,null,null,"NR = not relevant\nOK = in order / fine \nNOK = not in order",0.5]
["Transaction No.:",null,{"$f":"IF(Cover!E4=\"\",\"\",Cover!E4)","v":""},null,null,null,null,0.75]
[null,null,null,null,null,null,null,1,null,null,null,{"$f":"SUM(L9:L160)","v":0}]
["1. Documentation ",null,null,{"$f":"IF(B25>0,\"anwered incompletely\",\"answer completely\")","v":"answer completely"},null,null,{"$f":"AVERAGE('Overview of measures'!$G$9:$G$24)","v":1}]
["Question No.","Assessment","Measures","Who","Date","Effectiveness check","% closed",null,"NR = not relevant [100%]\nOK = in order / fine [100 %]\nNOK = not in order [0 %]\nblank = missing answer [0 %]","T1","BW","Rel"]
{"$rows_left_out":162}
{"sheet":"1. Documentation","index":3,"n_rows":18,"n_cols":11,"rows_kept":18,"cut":false,"hidden":false,"merged":[]}
["1","Rel.","Owner\nMech.\nElect.","Documentation / Orderliness ","Assess-ment\n[choise]","Regula-tion. / Norm","FAQ","Comments","Measures","Bewertung"]
["1.1","J","M/E/O","Does the machine have a rating plate / name plate? (details of the manufacturer, type, year of construction, etc.) ","OK","MRL 2006/42/EG          Annex,1.7.3","INFO",null,null,{"$f":"E2","v":"OK"},{"$f":"IF(J2=\"NOK\",Ausgabe(),\"okay\")","v":"okay"}]
["1.2","N","O","Is an up-to-date version of the operating manual available in the native language of the country where the machine is used? ","OK","MRL 2006/42/EG          Annex I,1.7.4","INFO",null,null,{"$f":"E3","v":"OK"},{"$f":"IF(J3=\"NOK\",Ausgabe(),\"okay\")","v":"okay"}]
["1.3","N","O","Do the operators, set-up personnel and maintenance personnel etc. have access to the operating manual and to all of the documents required for them to perform the work assigned to them? ","OK",null,"INFO","Version:",null,"OK",{"$f":"IF(J4=\"NOK\",Ausgabe(),\"okay\")","v":"okay"}]
["1.4","J","O","For machines used in Europe that were brought into circulation after 1995: Is an EC declaration of conformity available for the machine / system as a whole? ","OK","MRL 2006/42/EG          Annex I,1.7.4.2.","INFO",null,null,"OK",{"$f":"IF(J5=\"NOK\",Ausgabe(),\"okay\")","v":"okay"}]
["1.5","J","O/M/E","Does the operating manual contain a description of safe practices in production mode and for maintenance, troubleshooting, set-up and repair work? ","OK",null,"INFO",null,null,"OK",{"$f":"IF(J6=\"NOK\",Ausgabe(),\"okay\")","v":"okay"}]
["1.6","N","E","Is a circuit diagram available and is it up to date? ","OK",null,null,"Last update from: ",null,"OK",{"$f":"IF(J7=\"NOK\",Ausgabe(),\"okay\")","v":"okay"}]
["1.7",null,"M/E","Is a hydraulic diagram available and is it up to date? ","OK",null,null,"Last update from: ",null,"OK",{"$f":"IF(J8=\"NOK\",Ausgabe(),\"okay\")","v":"okay"}]
{"$rows_left_out":11}
{"sheet":"2. Use and installation","index":4,"n_rows":9,"n_cols":11,"rows_kept":9,"cut":false,"hidden":false,"merged":[]}
["2","Rel.","Owner\nMech.\nElect.","Use and installation","Assess-ment\n[choise]","Regula-tion. / Norm","FAQ","Comments","Measures","Bewertung"]
["2.1","J","O","Is the machine solely used for the purpose for which it was designed and built by the manufacturer? (e.g. speed material, tools, etc.) ","blank",null,"INFO",null,null,{"$f":"E2","v":"blank"},{"$f":"IF(J2=\"NIO\",Ausgabe(),\"okay\")","v":"okay"}]
["2.2",null,"O","Is the machine or equipment solely operated under the ambient conditions specified by the manufacturer? (e.g. temperature, humidity, altitude, etc.) ","blank",null,"INFO",null,null,{"$f":"E3","v":"blank"},{"$f":"IF(J3=\"NIO\",Ausgabe(),\"okay\")","v":"okay"}]
["2.3",null,"M/E","Is the machine connected to the energy levels specified by the manufacturer?  (e.g. maximum pressure, electrical fuses, voltage, nominal frequency, etc.) ","blank",null,"INFO",null,null,"blank",{"$f":"IF(J4=\"NIO\",Ausgabe(),\"okay\")","v":"okay"}]
["2.4","N","O/M/E","Are the working zones adequately illuminated for the work performed in them? ","blank","BetrSichV Annex 2 / 2.4 ","INFO",null,null,"blank",{"$f":"IF(J5=\"NIO\",Ausgabe(),\"okay\")","v":"okay"}]
["2.5",null,"M/E","Are the maintenance and service areas adequately illuminated for the work performed in them? ","blank","Annex 1 / 2.9 ","INFO",null,null,"blank",{"$f":"IF(J6=\"NIO\",Ausgabe(),\"okay\")","v":"okay"}]
["2.6",null,"M","Has the machine been anchored / secured in accordance with the manufacturer's instructions and have the normal loads and stresses, which may be encountered in operational service, been taken into consideration? ","blank","MD 2006/42/EC          Annex I, 1.3.1 ","INFO",null,null,"blank",{"$f":"IF(J7=\"NIO\",Ausgabe(),\"okay\")","v":"okay"}]
["2.7","J","M","Have all machine parts, components, guards and safety devices been fitted properly and securely? ","blank",null,null,"Visual inspection",null,"blank",{"$f":"IF(J8=\"NIO\",Ausgabe(),\"okay\")","v":"okay"}]
{"$rows_left_out":2}
{"sheet":"3. Control syst. + command","index":5,"n_rows":42,"n_cols":11,"rows_kept":42,"cut":false,"hidden":false,"merged":[]}
["3","Rel.","Owner\nMech.\nElect.","Control systems and command facilities (operator control elements)","Assess-ment\n[choise]","Regula-tion. / Norm","FAQ","Comments","Measures","Bewertung"]
["3.1",null,"O/M/E","Have measures been taken to ensure that reasonably foreseeable human error during operation does not lead to hazardous situations? ","blank","MRL 2006/42/EG          Annex I,1.2.1","INFO","according to \nIEC 61508 / IEC 62061",null,{"$f":"E2","v":"blank"},{"$f":"IF(J2=\"NIO\",Ausgabe(),\"okay\")","v":"okay"}]
["3.2",null,"E/M","Have measures been taken to ensure that the machine cannot start unexpectedly? ","blank","MRL 2006/42/EG          Annex I,1.2.1","INFO","according to \nIEC 61508 / IEC 62061",null,{"$f":"E3","v":"blank"},{"$f":"IF(J3=\"NIO\",Ausgabe(),\"okay\")","v":"okay"}]
["3.3","J","E/M","Have measures been taken to ensure that the parameters of the machinery do not change in an uncontrolled way, where such change may lead to hazardous situations? ","blank","MRL 2006/42/EG          Annex I,1.2.1","INFO",null,null,"blank",{"$f":"IF(J4=\"NIO\",Ausgabe(),\"okay\")","v":"okay"}]
["3.4",null,"M/E","Have measures been taken to ensure that stop commands always have priority over start commands?","blank","MRL 2006/42/EG          Annex I,1.2.1","INFO",null,null,"blank",{"$f":"IF(J5=\"NIO\",Ausgabe(),\"okay\")","v":"okay"}]
["3.5",null,"M/E","Have measures been taken to ensure that objects, which constitute a potential risk, cannot fall or be ejected? ","blank","MRL 2006/42/EG          Annex I,1.2.1","INFO",null,null,"blank",{"$f":"IF(J6=\"NIO\",Ausgabe(),\"okay\")","v":"okay"}]
["3.6","J","M/E","Have measures been taken to ensure that potentially hazardous movements can be stopped at any time in any operating mode? ","blank","MRL 2006/42/EG          Annex I,1.2.1","INFO",null,null,"blank",{"$f":"IF(J7=\"NIO\",Ausgabe(),\"okay\")","v":"okay"}]
["Command facilities ",null,null,null,null,null,null,null,null,null,{"$f":"IF(J8=\"NIO\",Ausgabe(),\"okay\")","v":"okay"}]
{"$rows_left_out":35}
{"sheet":"4. Protection against mech. haz","index":6,"n_rows":116,"n_cols":11,"rows_kept":116,"cut":false,"hidden":false,"merged":[]}
["4","Rel.","Owner\nMech.\nElect.","Protection against mechanical hazards ","Assess-ment\n[choise]","Regula-tion. / Norm","FAQ","Comments","Measures","Bewertung"]
["4.1",null,"M","Have protective measures been implemented to guard against hazards caused by machine parts breaking, bursting and shattering? ","blank","MD 2006/42/EG          Annex I,1.3.2","INFO",null,null,{"$f":"E2","v":"blank"},{"$f":"IF(J2=\"NIO\",Ausgabe(),\"okay\")","v":"okay"}]
["4.2",null,"M","Have all parts of the machine been fitted properly and securely? ","blank","MD 2006/42/EG          Annex I,1.3.2","INFO",null,null,{"$f":"E3","v":"blank"},{"$f":"IF(J3=\"NIO\",Ausgabe(),\"okay\")","v":"okay"}]
["4.3",null,"M/E","Are all cables, pipes, leads and hoses protected and secured? (e.g. by hydraulic, pneumatic and thermal means) ","blank",null,null,null,null,"blank",{"$f":"IF(J4=\"NIO\",Ausgabe(),\"okay\")","v":"okay"}]
["4.4",null,"M/E","Have safety devices been installed that prevent machine components / loads falling or sagging? Hydraulic / pneumatic check valves or mechanical fall arresters. ","blank","MD 2006/42/EG          Annex I,1.3.3 Annex I, 1.3.9.","INFO",null,null,"blank",{"$f":"IF(J5=\"NIO\",Ausgabe(),\"okay\")","v":"okay"}]
["4.5","J","M","Have measures been taken to ensure that accessible machine parts have no sharp or rough edges and no projecting components? ","blank","MD 2006/42/EG          Anhnex I,1.3.4","INFO",null,null,"blank",{"$f":"IF(J6=\"NIO\",Ausgabe(),\"okay\")","v":"okay"}]
["Risks arising from moving parts ",null,null,null,null,null,null,null,null,null,{"$f":"IF(J7=\"NIO\",Ausgabe(),\"okay\")","v":"okay"}]
["4.6",null,"M/E","Do the selected guards and safety devices prevent access to danger zones or bring potentially hazardous movements to a standstill before personnel can reach the danger zones?\n\n(minimum safety clearances are taken into account) ","blank","MD 2006/42/EG          Annex I,1.3.7     (EN 13857)","INFO",null,null,"blank",{"$f":"IF(J8=\"NIO\",Ausgabe(),\"okay\")","v":"okay"}]
{"$rows_left_out":109}
{"sheet":"5. Other hazards ","index":7,"n_rows":11,"n_cols":11,"rows_kept":11,"cut":false,"hidden":false,"merged":[]}
["5","Rel.","Owner\nMech.\nElect.","Others hazards","Assess-ment\n[choise]","Regula-tion. / Norm","FAQ","Comments","Measures","Bewertung"]
["Hazards arising from hot and cold surfaces "]
["5.1",null,"E/M","Have appropriate technical protective measures been taken to reliably prevent personnel coming into contact with very hot or very cold parts, or does question 5.2 apply?\n(e.g. Contact duration 0.5 s, metal surface --> burning threshold 67°C (153°F); \nContact duration 0.5 s, plastic surface --> buring threshold 90°C (194°F)) ","blank","BetrSichV / 2.10","INFO","ISO 13732-1-2006-Ergonomics of thermal environment - Methods for the assessment of human responses to contact with surfaces",null,{"$f":"E3","v":"blank"},{"$f":"IF(J3=\"NIO\",Ausgabe(),\"okay\")","v":"okay"}]
["5.2",null,"E/M/O","Where this is not possible, is contact prevented by handling equipment or personal protective equipment worn by the personnel? ","blank","MD 2006/42/EC          Annex I, 1.5.5.","INFO",null,null,{"$f":"E4","v":"blank"},{"$f":"IF(J4=\"NIO\",Ausgabe(),\"okay\")","v":"okay"}]
["5.3","N","E/M/O","Are the hot and cold surfaces marked accordingly? ","blank","MD 2006/42/EC          Annex I, 1.5.5.",null,null,null,"blank",{"$f":"IF(J5=\"NIO\",Ausgabe(),\"okay\")","v":"okay"}]
["Hazards caused by gas, vapor, mist, liquid and dust \nVisual inspection, working zone analysis, test record \n",null,null,null,null,null,null,null,null,null,{"$f":"IF(J6=\"NIO\",Ausgabe(),\"okay\")","v":"okay"}]
["5.4",null,"O","Have extraction facilities been installed to extract such emissions at source? (e.g. workplace limits) ","blank","MD 2006/42/EC          Annex I, 1.5.13.","INFO",null,null,"blank",{"$f":"IF(J7=\"NIO\",Ausgabe(),\"okay\")","v":"okay"}]
["Risk of personnel slipping, tripping or falling ",null,null,null,null,null,null,null,null,null,{"$f":"IF(J8=\"NIO\",Ausgabe(),\"okay\")","v":"okay"}]
{"$rows_left_out":4}
{"sheet":"6. Setting up Maintanace Serv.","index":8,"n_rows":127,"n_cols":11,"rows_kept":127,"cut":false,"hidden":false,"merged":[]}
["6","Rel.","Owner\nMech.\nElect.","Setting up / Maintenance / Service","Assess-ment\n[choise]","Regula-tion. / Norm","FAQ","Comments","Measures","Bewertung"]
["Setting up / Maintenance / Service"]
["6.1",null,"M/E","Do personnel have safe access to all of the areas required to perform their work safely? ","blank","MD 2006/42/EC          Annex I, 1.6.4","INFO",null,null,{"$f":"E3","v":"blank"},{"$f":"IF(J3=\"NIO\",Ausgabe(),\"okay\")","v":"okay"}]
["Maintenance, service, cleaning and debugging work ",null,null,null,null,null,null,null,null,null,{"$f":"IF(J4=\"NIO\",Ausgabe(),\"okay\")","v":"okay"}]
["6.2","J","M/E","Do personnel have safe access to all of the areas required to perform their work safely? ","blank","BetrSichV Annex 1 / 2.15","INFO",null,null,{"$f":"E5","v":"blank"},{"$f":"IF(J5=\"NIO\",Ausgabe(),\"okay\")","v":"okay"}]
["6.3",null,"M/E","Can all work associated with maintenance, service, cleaning and debugging be carried out with the machine at a complete standstill, or can appropriate protective measures be implemented? ","blank","BetrSichV Annex 1 / 2.12","INFO",null,null,"blank",{"$f":"IF(J6=\"NIO\",Ausgabe(),\"okay\")","v":"okay"}]
["6.4",null,"M/E","Are protective measures implemented when work has to be performed under raised loads? ","blank",null,"INFO",null,null,"blank",{"$f":"IF(J7=\"NIO\",Ausgabe(),\"okay\")","v":"okay"}]
["6.5","J","M/E","Have protective measures been implemented against hazards associated with stored / residual energies? (e.g. pressure reservoirs, hydraulic accumulators, electrical capacitors, etc.)","blank",null,"INFO",null,null,"blank",{"$f":"IF(J8=\"NIO\",Ausgabe(),\"okay\")","v":"okay"}]
{"$rows_left_out":120}
{"sheet":"7. Risk ass. with electr. Energ","index":9,"n_rows":12,"n_cols":11,"rows_kept":12,"cut":false,"hidden":false,"merged":[]}
["7","Rel.","Owner\nMech.\nElect.","Risks associated with electrical energy","Assess-ment\n[choise]","Regula-tion. / Norm","FAQ","Comments","Measures","Bewertung"]
["7.1","N","E","Does the machine and its control devices have electric shock protection? (cable insulation, operator control elements etc.) ","blank","EN 60204 Section 6.2",null,null,null,{"$f":"E2","v":"blank"},{"$f":"IF(J2=\"NIO\",Ausgabe(),\"okay\")","v":"okay"}]
["7.2",null,"E","Adequate protection class for the housing. ","blank","EN 60204 Section 6.2","INFO","IP-Rating \n- IEC/EN 60529 \n– NFPA 70   (National Electrical Code)\n– CEC (Canadian Electrical Code)\n– UL 50\n– CSA-C22.2 No. 94-M91 (2006)\n– NEMA 250 -20031)",null,{"$f":"E3","v":"blank"},{"$f":"IF(J3=\"NIO\",Ausgabe(),\"okay\")","v":"okay"}]
["7.3",null,"E","Protection by insulating live parts (e.g. cables) ","blank","EN 60204 Section 6.2",null,null,null,"blank",{"$f":"IF(J4=\"NIO\",Ausgabe(),\"okay\")","v":"okay"}]
["7.4",null,"E","Protection by covering, providing adequate clearances or barriers. ","blank","EN 60204 Section 6.2",null,null,null,"blank",{"$f":"IF(J5=\"NIO\",Ausgabe(),\"okay\")","v":"okay"}]
["7.5","J","O/E","Have measures been taken to ensure that only suitably qualified, authorized personnel have access to switchgear cabinets and control rooms? (keys; special tools)","blank","EN 60204 Section 6.2",null,null,null,"blank",{"$f":"IF(J6=\"NIO\",Ausgabe(),\"okay\")","v":"okay"}]
["7.6",null,"E","Does the machine and/or the electrical installation have protection against indirect contact with electric current in the event of an insulation fault?\n(e.g. protective circuit, correctly dimensioned protective conductor, protective equipotential bonding of the machine housing, insulation monitoring, equipotential bonding, etc.)","blank","EN 60204 Section 6.3",null,null,null,"blank",{"$f":"IF(J7=\"NIO\",Ausgabe(),\"okay\")","v":"okay"}]
["7.7",null,"E","Are there conductive cable runs and cable channels connected to the protective circuit?","blank",null,null,null,null,"blank",{"$f":"IF(J8=\"NIO\",Ausgabe(),\"okay\")","v":"okay"}]
{"$rows_left_out":5}
{"sheet":"8. Ergonomie","index":10,"n_rows":19,"n_cols":11,"rows_kept":19,"cut":false,"hidden":true,"merged":[]}
["8","Rel.","Betreiber\nMech.\nElekt.","Ergonomie","Bewer-tung\n[Auswahl]","Richtl. / Norm","FAQ","Bemerkungen","Maßnahmen","Bewertung"]
["8.1",null,"B","Mindestgröße von Ganzkörperzugängen an Maschinenarbeitsplätzen. Erlauben die Durchgänge innerhalb der Maschine einen ungehinderten und sicheren Zugang zu den Arbeitsplätzen, um Maßnahmen, wie die Betätigung von Stellteilen, das Überwachen von Arbeitsabläufen und das Prüfen von Arbeitsergebnissen, ausführen zu können?","NR","DIN EN 547-1:2009",null,null,null,{"$f":"E2","v":"NR"},{"$f":"IF(J2=\"NIO\",Ausgabe(),\"okay\")","v":"okay"}]
["8.2","J","B/M","Mindestmaße von Zugangsöffnungen.Sind geeignete Zugangsöffnungen vorgesehen, um das Betätigen von Stellteilen, das Beobachten von Vorgängen sowie Reinigungs-, Rüst- und Wartungsarbeiten zu ermöglichen?","NR",null,null,null,"test",{"$f":"E3","v":"NR"},{"$f":"IF(J3=\"NIO\",Ausgabe(),\"okay\")","v":"okay"}]
["8.3","J","B","Arbeitshöhen bei stehender Körperhaltung Sind die Arbeitshöhen für Steharbeitsplätze, die mehr als 1h/Tag genutzt werden, so gewählt, dass sie den Maßen und Kraftanforderungen der Werkstücke entsprechen?","NR","DIN EN ISO 14 738: 2008",null,null,null,"NR",{"$f":"IF(J4=\"NIO\",Ausgabe(),\"okay\")","v":"okay"}]
["8.4",null,"B","Beinraummaße. Ist der Raumbedarf unter der Arbeitsfläche so bemessen, dass abhängig von der gewählten Arbeitshaltung „Stehen“ oder „Stehen mit Stehhilfe“ ein ausreichender Raum für die Beine verbleibt?","NR","DIN EN ISO 14 738:2008",null,null,null,"NR",{"$f":"IF(J5=\"NIO\",Ausgabe(),\"okay\")","v":"okay"}]
["8.5",null,"B","Greifraum und Arbeitsraum Können alle Handhabungen und Betätigungen innerhalb des zulässigen Greifraums ausgeführt\nwerden?","NR",null,null,null,"test","NR",{"$f":"IF(J6=\"NIO\",Ausgabe(),\"okay\")","v":"okay"}]
["8.6",null,"B","Sehraum Ist der Sehraum so gewählt, dass bei der Beobachtung der Tätigkeit oder des Prozesses ungünstige Körperhaltungen vermieden werden?","NR","DIN EN 1005-4:2009     DIN EN ISO 14 738:2008",null,null,null,"NR",{"$f":"IF(J7=\"NIO\",Ausgabe(),\"okay\")","v":"okay"}]
["8.7",null,"B","Vermeidung von extremen Körperhaltungen Werden hohe Bewegungsfrequenzen oder statische Haltungen in ungünstigen oder extremen Körperhaltungen vermieden?","NR","DIN EN 1005-4:2009",null,null,null,"NR",{"$f":"IF(J8=\"NIO\",Ausgabe(),\"okay\")","v":"okay"}]
{"$rows_left_out":12}
{"sheet":"FAQ","index":11,"n_rows":135,"n_cols":2,"rows_kept":135,"cut":false,"hidden":false,"merged":[]}
[]
["FAQ"]
[]
["Nr. ","Inhalt"]
["1.1","All machinery must be marked visibly, legibly and indelibly with the following minimum particulars:\n— the business name and full address of the manufacturer and, where applicable, his authorised representative,\n— designation of the machinery,\n— the CE Marking (see Annex III),\n— designation of series or type,\n— serial number, if any,\n— the year of construction, that is the year in which the manufacturing process is completed. \n"]
["1.2","All machinery must be accompanied by instructions in the official Community language or languages of the Member State in which it is placed on the market and/or put into service.\nThe instructions accompanying the machinery must be either ‘Original instructions’ or a ‘Translation of the original instructions’,  in which case the translation must be accompanied by the original instructions. "]
["1.3","k.A."]
["1.4","Each instruction manual must contain, where applicable, at least the following information:\n(a) the business name and full address of the manufacturer and of his authorised representative;\n(b) the designation of the machinery as marked on the machinery itself, except for the serial number (see section 1.7.3);\n(c) the EC declaration of conformity, or a document setting out the contents of the EC declaration of conformity, showing the particulars of the machinery, not necessarily including the serial number and the signature; "]
{"$rows_left_out":128}
{"sheet":"D 02-044 PL","index":12,"n_rows":9,"n_cols":16,"rows_kept":9,"cut":false,"hidden":true,"merged":[[7,12,7,13],[3,1,3,4],[3,8,3,9],[5,1,5,4],[7,0,8,0],[7,1,8,1],[7,2,8,2],[7,3,7,6],[7,7,7,11]]}
["D 02-044 – Annex 2",null,null,null,null,null,null,null,null,null,null,null,"Version:  1",null,null,"INFO ZU PL"]
["Documentation Performance Level (PL)",null,null,null,null,null,null,null,null,null,null,null,"Valid from:  1st January 2017"]
[]
["Machine:",null,null,null,null,null,null,"Date:"]
[]
["Name / Signature:"]
[]
["Risk","Safety device\n(e.g. interlocked protective device, light curtain, etc.)","Operation mode","Risk Assessment\n(EN ISO 13849)",null,null,null,"Performance Level\nEstimation\n(EN ISO 13849)",null,null,null,null,"Remaining risk",null,"Measures"]
{"$rows_left_out":1}